Information card for entry 4132704
Formula | C53 H64 O12 S2 |
Calculated formula | C53 H64 O12 S2 |
SMILES | O1CCSCCOCCOCCSCCOc2c3cc1c(c2)Cc1c(OC)cc(c(OC)c1)Cc1c(OC)cc(c(OC)c1)Cc1c(OC)cc(c(OC)c1)Cc1c(OC)cc(c(OC)c1)C3 |
Title of publication | pseudo[1]Catenane-Type Pillar[5]thiacrown Whose Planar Chiral Inversion is Triggered by Metal Cation and Controlled by Anion. |
Authors of publication | Lee, Eunji; Ju, Huiyeong; Park, In-Hyeok; Jung, Jong Hwa; Ikeda, Mari; Kuwahara, Shunsuke; Habata, Yoichi; Lee, Shim Sung |
Journal of publication | Journal of the American Chemical Society |
Year of publication | 2018 |
Journal volume | 140 |
Journal issue | 30 |
Pages of publication | 9669 - 9677 |
a | 37.029 ± 0.0006 Å |
b | 11.0822 ± 0.0003 Å |
c | 12.0393 ± 0.0002 Å |
α | 90° |
β | 90° |
γ | 90° |
Cell volume | 4940.48 ± 0.18 Å3 |
Cell temperature | 173 ± 2 K |
Ambient diffraction temperature | 173 ± 2 K |
Number of distinct elements | 4 |
Space group number | 33 |
Hermann-Mauguin space group symbol | P n a 21 |
Hall space group symbol | P 2c -2n |
Residual factor for all reflections | 0.0707 |
Residual factor for significantly intense reflections | 0.0517 |
Weighted residual factors for significantly intense reflections | 0.1207 |
Weighted residual factors for all reflections included in the refinement | 0.1324 |
Goodness-of-fit parameter for all reflections included in the refinement | 1.018 |
Diffraction radiation wavelength | 0.71073 Å |
Diffraction radiation type | MoKα |