Information card for entry 4132822
Formula | C11.87 H5 O16 Zr3 |
Calculated formula | C11.8666 H5 O16 Zr3 |
Title of publication | A Flexible Metal-Organic Framework with 4-Connected Zr<sub>6</sub> Nodes. |
Authors of publication | Zhang, Yuanyuan; Zhang, Xuan; Lyu, Jiafei; Otake, Ken-Ichi; Wang, Xingjie; Redfern, Louis R.; Malliakas, Christos D.; Li, Zhanyong; Islamoglu, Timur; Wang, Bo; Farha, Omar K. |
Journal of publication | Journal of the American Chemical Society |
Year of publication | 2018 |
Journal volume | 140 |
Journal issue | 36 |
Pages of publication | 11179 - 11183 |
a | 25.1372 ± 0.0007 Å |
b | 28.199 ± 0.0008 Å |
c | 15.8108 ± 0.0005 Å |
α | 90° |
β | 90° |
γ | 90° |
Cell volume | 11207.4 ± 0.6 Å3 |
Cell temperature | 200 K |
Ambient diffraction temperature | 199.99 K |
Number of distinct elements | 4 |
Space group number | 74 |
Hermann-Mauguin space group symbol | I m m a |
Hall space group symbol | -I 2b 2 |
Residual factor for all reflections | 0.0692 |
Residual factor for significantly intense reflections | 0.0473 |
Weighted residual factors for significantly intense reflections | 0.1401 |
Weighted residual factors for all reflections included in the refinement | 0.1501 |
Goodness-of-fit parameter for all reflections included in the refinement | 1.076 |
Diffraction radiation probe | x-ray |
Diffraction radiation wavelength | 0.71073 Å |
Diffraction radiation type | MoKα |