Information card for entry 4132824
Formula | C11 H5 O16 Zr3 |
Calculated formula | C11 H5 O16 Zr3 |
Title of publication | A Flexible Metal-Organic Framework with 4-Connected Zr<sub>6</sub> Nodes. |
Authors of publication | Zhang, Yuanyuan; Zhang, Xuan; Lyu, Jiafei; Otake, Ken-Ichi; Wang, Xingjie; Redfern, Louis R.; Malliakas, Christos D.; Li, Zhanyong; Islamoglu, Timur; Wang, Bo; Farha, Omar K. |
Journal of publication | Journal of the American Chemical Society |
Year of publication | 2018 |
Journal volume | 140 |
Journal issue | 36 |
Pages of publication | 11179 - 11183 |
a | 25.385 ± 0.003 Å |
b | 30.661 ± 0.003 Å |
c | 8.2771 ± 0.0009 Å |
α | 90° |
β | 90° |
γ | 90° |
Cell volume | 6442.3 ± 1.2 Å3 |
Cell temperature | 200 K |
Ambient diffraction temperature | 200 K |
Number of distinct elements | 4 |
Space group number | 74 |
Hermann-Mauguin space group symbol | I m m a |
Hall space group symbol | -I 2b 2 |
Residual factor for all reflections | 0.1164 |
Residual factor for significantly intense reflections | 0.0882 |
Weighted residual factors for significantly intense reflections | 0.2212 |
Weighted residual factors for all reflections included in the refinement | 0.239 |
Goodness-of-fit parameter for all reflections included in the refinement | 1.037 |
Diffraction radiation probe | x-ray |
Diffraction radiation wavelength | 0.71073 Å |
Diffraction radiation type | MoKα |