Information card for entry 4132827
Formula | C14 H17 N O2 |
Calculated formula | C14 H17 N O2 |
SMILES | O=C1N(C[C@](/C1=C/c1ccccc1)(C)CO)C |
Title of publication | Versatile Cobalt-Catalyzed Enantioselective Entry to Boryl-Functionalized All-Carbon Quaternary Stereogenic Centers. |
Authors of publication | Wang, Chao; Ge, Shaozhong |
Journal of publication | Journal of the American Chemical Society |
Year of publication | 2018 |
Journal volume | 140 |
Journal issue | 34 |
Pages of publication | 10687 - 10690 |
a | 8.2246 ± 0.0004 Å |
b | 11.1146 ± 0.0005 Å |
c | 13.3192 ± 0.0006 Å |
α | 90° |
β | 90° |
γ | 90° |
Cell volume | 1217.55 ± 0.1 Å3 |
Cell temperature | 100 ± 2 K |
Ambient diffraction temperature | 100 ± 2 K |
Number of distinct elements | 4 |
Space group number | 19 |
Hermann-Mauguin space group symbol | P 21 21 21 |
Hall space group symbol | P 2ac 2ab |
Residual factor for all reflections | 0.0258 |
Residual factor for significantly intense reflections | 0.0256 |
Weighted residual factors for significantly intense reflections | 0.0672 |
Weighted residual factors for all reflections included in the refinement | 0.0675 |
Goodness-of-fit parameter for all reflections included in the refinement | 1.061 |
Diffraction radiation wavelength | 1.54178 Å |
Diffraction radiation type | CuKα |