Information card for entry 4132916
Formula | C26.25 H16 N0.5 O8 Zr1.5 |
Calculated formula | C26.25 H14 N0.5 O8 Zr1.5 |
Title of publication | Enhancing Pore-Environment Complexity Using a Trapezoidal Linker: Toward Stepwise Assembly of Multivariate Quinary Metal-Organic Frameworks. |
Authors of publication | Pang, Jiandong; Yuan, Shuai; Qin, Junsheng; Wu, Mingyan; Lollar, Christina T.; Li, Jialuo; Huang, Ning; Li, Bao; Zhang, Peng; Zhou, Hong-Cai |
Journal of publication | Journal of the American Chemical Society |
Year of publication | 2018 |
Journal volume | 140 |
Journal issue | 39 |
Pages of publication | 12328 - 12332 |
a | 18.9651 ± 0.0006 Å |
b | 33.3385 ± 0.0012 Å |
c | 33.5366 ± 0.0013 Å |
α | 90° |
β | 90° |
γ | 90° |
Cell volume | 21204.1 ± 1.3 Å3 |
Cell temperature | 100 ± 2 K |
Ambient diffraction temperature | 100 ± 2 K |
Number of distinct elements | 5 |
Space group number | 71 |
Hermann-Mauguin space group symbol | I m m m |
Hall space group symbol | -I 2 2 |
Residual factor for all reflections | 0.0571 |
Residual factor for significantly intense reflections | 0.0414 |
Weighted residual factors for significantly intense reflections | 0.104 |
Weighted residual factors for all reflections included in the refinement | 0.1063 |
Goodness-of-fit parameter for all reflections included in the refinement | 1.143 |
Diffraction radiation wavelength | 1.54184 Å |
Diffraction radiation type | CuKα |