Information card for entry 4132918
Formula | C53 H27 N O16 Zr3 |
Calculated formula | C53 H27 N O16 Zr3 |
Title of publication | Enhancing Pore-Environment Complexity Using a Trapezoidal Linker: Toward Stepwise Assembly of Multivariate Quinary Metal-Organic Frameworks. |
Authors of publication | Pang, Jiandong; Yuan, Shuai; Qin, Junsheng; Wu, Mingyan; Lollar, Christina T.; Li, Jialuo; Huang, Ning; Li, Bao; Zhang, Peng; Zhou, Hong-Cai |
Journal of publication | Journal of the American Chemical Society |
Year of publication | 2018 |
Journal volume | 140 |
Journal issue | 39 |
Pages of publication | 12328 - 12332 |
a | 23.1736 ± 0.0006 Å |
b | 31.635 ± 0.0009 Å |
c | 32.1726 ± 0.0009 Å |
α | 90° |
β | 90° |
γ | 90° |
Cell volume | 23585.6 ± 1.1 Å3 |
Cell temperature | 150 ± 2 K |
Ambient diffraction temperature | 150.02 K |
Number of distinct elements | 5 |
Space group number | 71 |
Hermann-Mauguin space group symbol | I m m m |
Hall space group symbol | -I 2 2 |
Residual factor for all reflections | 0.0824 |
Residual factor for significantly intense reflections | 0.0687 |
Weighted residual factors for significantly intense reflections | 0.1987 |
Weighted residual factors for all reflections included in the refinement | 0.2101 |
Goodness-of-fit parameter for all reflections included in the refinement | 1.088 |
Diffraction radiation probe | x-ray |
Diffraction radiation wavelength | 1.54184 Å |
Diffraction radiation type | CuKα |