Information card for entry 4132921
Formula | C53.5 H30 N O16 Zr3 |
Calculated formula | C53.5 H28 N O16 Zr3 |
Title of publication | Enhancing Pore-Environment Complexity Using a Trapezoidal Linker: Toward Stepwise Assembly of Multivariate Quinary Metal-Organic Frameworks. |
Authors of publication | Pang, Jiandong; Yuan, Shuai; Qin, Junsheng; Wu, Mingyan; Lollar, Christina T.; Li, Jialuo; Huang, Ning; Li, Bao; Zhang, Peng; Zhou, Hong-Cai |
Journal of publication | Journal of the American Chemical Society |
Year of publication | 2018 |
Journal volume | 140 |
Journal issue | 39 |
Pages of publication | 12328 - 12332 |
a | 21.4248 ± 0.0007 Å |
b | 31.7902 ± 0.0011 Å |
c | 33.5013 ± 0.0011 Å |
α | 90° |
β | 90° |
γ | 90° |
Cell volume | 22817.7 ± 1.3 Å3 |
Cell temperature | 100 ± 2 K |
Ambient diffraction temperature | 100 ± 2 K |
Number of distinct elements | 5 |
Space group number | 71 |
Hermann-Mauguin space group symbol | I m m m |
Hall space group symbol | -I 2 2 |
Residual factor for all reflections | 0.0406 |
Residual factor for significantly intense reflections | 0.0332 |
Weighted residual factors for significantly intense reflections | 0.0871 |
Weighted residual factors for all reflections included in the refinement | 0.0881 |
Goodness-of-fit parameter for all reflections included in the refinement | 1.031 |
Diffraction radiation wavelength | 1.54184 Å |
Diffraction radiation type | CuKα |