Information card for entry 4132925
Formula | C54 H30 O18 Zr3 |
Calculated formula | C54 H28 O18 Zr3 |
Title of publication | Enhancing Pore-Environment Complexity Using a Trapezoidal Linker: Toward Stepwise Assembly of Multivariate Quinary Metal-Organic Frameworks. |
Authors of publication | Pang, Jiandong; Yuan, Shuai; Qin, Junsheng; Wu, Mingyan; Lollar, Christina T.; Li, Jialuo; Huang, Ning; Li, Bao; Zhang, Peng; Zhou, Hong-Cai |
Journal of publication | Journal of the American Chemical Society |
Year of publication | 2018 |
Journal volume | 140 |
Journal issue | 39 |
Pages of publication | 12328 - 12332 |
a | 23.1663 ± 0.0006 Å |
b | 34.0796 ± 0.0008 Å |
c | 14.9174 ± 0.0004 Å |
α | 90° |
β | 90° |
γ | 90° |
Cell volume | 11777.3 ± 0.5 Å3 |
Cell temperature | 100 ± 2 K |
Ambient diffraction temperature | 100.01 K |
Number of distinct elements | 4 |
Space group number | 65 |
Hermann-Mauguin space group symbol | C m m m |
Hall space group symbol | -C 2 2 |
Residual factor for all reflections | 0.08 |
Residual factor for significantly intense reflections | 0.0716 |
Weighted residual factors for significantly intense reflections | 0.209 |
Weighted residual factors for all reflections included in the refinement | 0.2177 |
Goodness-of-fit parameter for all reflections included in the refinement | 1.073 |
Diffraction radiation probe | x-ray |
Diffraction radiation wavelength | 1.54184 Å |
Diffraction radiation type | CuKα |