Information card for entry 4132935
Formula | C8 H26 Ga2 N2 O S7 Sb2 |
Calculated formula | C8 H24 Ga2 N2 O S7 Sb2 |
Title of publication | Efficient Removal of [UO<sub>2</sub>]<sup>2+</sup>, Cs<sup>+</sup>, and Sr<sup>2+</sup> Ions by Radiation-Resistant Gallium Thioantimonates. |
Authors of publication | Feng, Mei-Ling; Sarma, Debajit; Gao, Yu-Jie; Qi, Xing-Hui; Li, Wei-An; Huang, Xiao-Ying; Kanatzidis, Mercouri G. |
Journal of publication | Journal of the American Chemical Society |
Year of publication | 2018 |
Journal volume | 140 |
Journal issue | 35 |
Pages of publication | 11133 - 11140 |
a | 11.7107 ± 0.0002 Å |
b | 11.7107 ± 0.0002 Å |
c | 34.3827 ± 0.0017 Å |
α | 90° |
β | 90° |
γ | 90° |
Cell volume | 4715.3 ± 0.3 Å3 |
Cell temperature | 295 ± 2 K |
Ambient diffraction temperature | 295 ± 2 K |
Number of distinct elements | 7 |
Space group number | 88 |
Hermann-Mauguin space group symbol | I 41/a :2 |
Hall space group symbol | -I 4ad |
Residual factor for all reflections | 0.1025 |
Residual factor for significantly intense reflections | 0.064 |
Weighted residual factors for significantly intense reflections | 0.1264 |
Weighted residual factors for all reflections included in the refinement | 0.1432 |
Goodness-of-fit parameter for all reflections included in the refinement | 1.01 |
Diffraction radiation wavelength | 0.71073 Å |
Diffraction radiation type | MoKα |