Information card for entry 4132947
Formula |
C20.83 H12 Cu D2.48 N2 O4 |
Calculated formula |
C20.8264 H12 Cu D2.4792 N2 O4 |
Title of publication |
Boosting Ethane/Ethylene Separation within Isoreticular Ultramicroporous Metal-Organic Frameworks. |
Authors of publication |
Lin, Rui-Biao; Wu, Hui; Li, Libo; Tang, Xiao-Liang; Li, Zhiqiang; Gao, Junkuo; Cui, Hui; Zhou, Wei; Chen, Banglin |
Journal of publication |
Journal of the American Chemical Society |
Year of publication |
2018 |
Journal volume |
140 |
Journal issue |
40 |
Pages of publication |
12940 - 12946 |
a |
5.761 ± 0.0007 Å |
b |
11.0868 ± 0.0013 Å |
c |
14.5326 ± 0.0013 Å |
α |
90° |
β |
94.069 ± 0.007° |
γ |
90° |
Cell volume |
925.87 ± 0.18 Å3 |
Cell temperature |
297 K |
Ambient diffraction temperature |
297 K |
Number of distinct elements |
6 |
Space group number |
14 |
Hermann-Mauguin space group symbol |
P 1 21/c 1 |
Hall space group symbol |
-P 2ybc |
RFsqd |
0.09475 |
Goodness-of-fit parameter for all reflections |
1.07 |
Method of determination |
powder diffraction |
Diffraction radiation probe |
neutron |
Diffraction radiation wavelength |
2.0774 Å |
Yes |
No |
No |