Information card for entry 4132961
Formula | C20 H20 N2 O4 |
Calculated formula | C20 H20 N2 O4 |
SMILES | O1C(=O)C(=NNc2c(C(=O)OCCCCC1)cccc2)c1ccccc1 |
Title of publication | Building Strain with Large Macrocycles and Using It To Tune the Thermal Half-Lives of Hydrazone Photochromes. |
Authors of publication | Li, Quan; Qian, Hai; Shao, Baihao; Hughes, Russell P.; Aprahamian, Ivan |
Journal of publication | Journal of the American Chemical Society |
Year of publication | 2018 |
Journal volume | 140 |
Journal issue | 37 |
Pages of publication | 11829 - 11835 |
a | 12.418 ± 0.006 Å |
b | 8.669 ± 0.004 Å |
c | 16.915 ± 0.008 Å |
α | 90° |
β | 105.261 ± 0.005° |
γ | 90° |
Cell volume | 1756.7 ± 1.4 Å3 |
Cell temperature | 173 ± 2 K |
Ambient diffraction temperature | 173 ± 2 K |
Number of distinct elements | 4 |
Space group number | 14 |
Hermann-Mauguin space group symbol | P 1 21/n 1 |
Hall space group symbol | -P 2yn |
Residual factor for all reflections | 0.0563 |
Residual factor for significantly intense reflections | 0.0426 |
Weighted residual factors for significantly intense reflections | 0.1095 |
Weighted residual factors for all reflections included in the refinement | 0.1224 |
Goodness-of-fit parameter for all reflections included in the refinement | 1.036 |
Diffraction radiation wavelength | 0.71073 Å |
Diffraction radiation type | MoKα |