Information card for entry 4132965
Formula | C19.25 H18.75 N2 O4.125 |
Calculated formula | C19.25 H18.75 N2 O4.125 |
Title of publication | Building Strain with Large Macrocycles and Using It To Tune the Thermal Half-Lives of Hydrazone Photochromes. |
Authors of publication | Li, Quan; Qian, Hai; Shao, Baihao; Hughes, Russell P.; Aprahamian, Ivan |
Journal of publication | Journal of the American Chemical Society |
Year of publication | 2018 |
Journal volume | 140 |
Journal issue | 37 |
Pages of publication | 11829 - 11835 |
a | 21.8904 ± 0.0004 Å |
b | 22.987 ± 0.0004 Å |
c | 6.9137 ± 0.0001 Å |
α | 90° |
β | 90° |
γ | 90° |
Cell volume | 3478.94 ± 0.1 Å3 |
Cell temperature | 173 ± 2 K |
Ambient diffraction temperature | 173 ± 2 K |
Number of distinct elements | 4 |
Space group number | 45 |
Hermann-Mauguin space group symbol | I b a 2 |
Hall space group symbol | I 2 -2c |
Residual factor for all reflections | 0.0679 |
Residual factor for significantly intense reflections | 0.0552 |
Weighted residual factors for significantly intense reflections | 0.1633 |
Weighted residual factors for all reflections included in the refinement | 0.1734 |
Goodness-of-fit parameter for all reflections included in the refinement | 1.084 |
Diffraction radiation wavelength | 1.54178 Å |
Diffraction radiation type | CuKα |