Information card for entry 4132982
Formula | C11 H36 I10 N4 Pb3 |
Calculated formula | C11 H36 I10 N4 Pb3 |
Title of publication | Two-Dimensional Halide Perovskites Incorporating Straight Chain Symmetric Diammonium Ions, (NH<sub>3</sub>C <sub>m</sub>H<sub>2 m</sub>NH<sub>3</sub>)(CH<sub>3</sub>NH<sub>3</sub>) <sub>n-1</sub>Pb <sub>n</sub>I<sub>3 n+1</sub> ( m = 4-9; n = 1-4). |
Authors of publication | Li, Xiaotong; Hoffman, Justin; Ke, Weijun; Chen, Michelle; Tsai, Hsinhan; Nie, Wanyi; Mohite, Aditya D.; Kepenekian, Mikaël; Katan, Claudine; Even, Jacky; Wasielewski, Michael R.; Stoumpos, Constantinos C.; Kanatzidis, Mercouri G. |
Journal of publication | Journal of the American Chemical Society |
Year of publication | 2018 |
Journal volume | 140 |
Journal issue | 38 |
Pages of publication | 12226 - 12238 |
a | 26.4807 ± 0.0009 Å |
b | 8.915 ± 0.007 Å |
c | 8.9145 ± 0.0008 Å |
α | 90° |
β | 99.6902° |
γ | 90° |
Cell volume | 2074.5 ± 1.6 Å3 |
Cell temperature | 293 K |
Ambient diffraction temperature | 293 K |
Number of distinct elements | 5 |
Space group number | 7 |
Hermann-Mauguin space group symbol | P 1 c 1 |
Hall space group symbol | P -2yc |
Residual factor for all reflections | 0.081 |
Residual factor for significantly intense reflections | 0.048 |
Weighted residual factors for significantly intense reflections | 0.0854 |
Weighted residual factors for all reflections included in the refinement | 0.0904 |
Goodness-of-fit parameter for significantly intense reflections | 1.97 |
Goodness-of-fit parameter for all reflections included in the refinement | 1.66 |
Diffraction radiation probe | x-ray |
Diffraction radiation wavelength | 0.71073 Å |
Diffraction radiation type | MoKα |