Information card for entry 4133012
Formula | C46 H64 B11 N O7 |
Calculated formula | C46 H64 B11 N O7 |
Title of publication | Palladium-Catalyzed Selective Five-Fold Cascade Arylation of the 12-Vertex Monocarborane Anion by B-H Activation. |
Authors of publication | Lin, Furong; Yu, Jing-Lu; Shen, Yunjun; Zhang, Shuo-Qing; Spingler, Bernhard; Liu, Jiyong; Hong, Xin; Duttwyler, Simon |
Journal of publication | Journal of the American Chemical Society |
Year of publication | 2018 |
Journal volume | 140 |
Journal issue | 42 |
Pages of publication | 13798 - 13807 |
a | 23.6242 ± 0.0015 Å |
b | 19.1081 ± 0.0009 Å |
c | 22.3852 ± 0.001 Å |
α | 90° |
β | 90° |
γ | 90° |
Cell volume | 10105 ± 0.9 Å3 |
Cell temperature | 293 ± 2 K |
Ambient diffraction temperature | 293.15 K |
Number of distinct elements | 5 |
Space group number | 60 |
Hermann-Mauguin space group symbol | P b c n |
Hall space group symbol | -P 2n 2ab |
Residual factor for all reflections | 0.1287 |
Residual factor for significantly intense reflections | 0.0796 |
Weighted residual factors for significantly intense reflections | 0.2146 |
Weighted residual factors for all reflections included in the refinement | 0.2654 |
Goodness-of-fit parameter for all reflections included in the refinement | 1.043 |
Diffraction radiation wavelength | 0.71073 Å |
Diffraction radiation type | MoKα |