Information card for entry 4133040
Formula | C21 H29 N O2 |
Calculated formula | C21 H29 N O2 |
SMILES | c1c(c(ccc1)C(C)(C)C)N1C(=O)[C@@H](C(C(C)C)(C)C)C(=C)C1=O |
Title of publication | Realizing the Photoene Reaction with Alkenes under Visible Light Irradiation and Bypassing the Favored [2 + 2]-Photocycloaddition. |
Authors of publication | Ahuja, Sapna; Raghunathan, Ramya; Kumarasamy, Elango; Jockusch, Steffen; Sivaguru, Jayaraman |
Journal of publication | Journal of the American Chemical Society |
Year of publication | 2018 |
Journal volume | 140 |
Journal issue | 41 |
Pages of publication | 13185 - 13189 |
a | 23.3289 ± 0.0006 Å |
b | 7.9711 ± 0.0002 Å |
c | 10.6124 ± 0.0003 Å |
α | 90° |
β | 110.47 ± 0.001° |
γ | 90° |
Cell volume | 1848.84 ± 0.09 Å3 |
Cell temperature | 100 K |
Ambient diffraction temperature | 100.01 K |
Number of distinct elements | 4 |
Space group number | 5 |
Hermann-Mauguin space group symbol | C 1 2 1 |
Hall space group symbol | C 2y |
Residual factor for all reflections | 0.0273 |
Residual factor for significantly intense reflections | 0.027 |
Weighted residual factors for significantly intense reflections | 0.0696 |
Weighted residual factors for all reflections included in the refinement | 0.07 |
Goodness-of-fit parameter for all reflections included in the refinement | 1.06 |
Diffraction radiation wavelength | 1.54178 Å |
Diffraction radiation type | CuKα |