Information card for entry 4133047
Formula | C15 H10 Br N O |
Calculated formula | C15 H10 Br N O |
SMILES | Br/C(=C1\NC(=O)c2ccccc12)c1ccccc1 |
Title of publication | Ir(III)-Catalyzed Stereoselective Haloamidation of Alkynes Enabled by Ligand Participation. |
Authors of publication | Hong, Seung Youn; Son, Junsoo; Kim, Dongwook; Chang, Sukbok |
Journal of publication | Journal of the American Chemical Society |
Year of publication | 2018 |
Journal volume | 140 |
Journal issue | 39 |
Pages of publication | 12359 - 12363 |
a | 13.412 ± 0.003 Å |
b | 14.379 ± 0.003 Å |
c | 15.278 ± 0.003 Å |
α | 91.54 ± 0.03° |
β | 106.29 ± 0.03° |
γ | 106.58 ± 0.03° |
Cell volume | 2692.1 ± 1.2 Å3 |
Cell temperature | 100 ± 2 K |
Ambient diffraction temperature | 100 ± 2 K |
Number of distinct elements | 5 |
Space group number | 2 |
Hermann-Mauguin space group symbol | P -1 |
Hall space group symbol | -P 1 |
Residual factor for all reflections | 0.0782 |
Residual factor for significantly intense reflections | 0.0726 |
Weighted residual factors for significantly intense reflections | 0.2156 |
Weighted residual factors for all reflections included in the refinement | 0.219 |
Goodness-of-fit parameter for all reflections included in the refinement | 1.073 |
Diffraction radiation wavelength | 0.7 Å |
Diffraction radiation type | synchrotron |