Information card for entry 4133060
Formula | C4 H11 Br I3 N Pb |
Calculated formula | C4.0002 H11.0004 Br1.0002 I3 N Pb |
Title of publication | A Room-Temperature Hybrid Lead Iodide Perovskite Ferroelectric. |
Authors of publication | Hua, Xiu-Ni; Liao, Wei-Qiang; Tang, Yuan-Yuan; Li, Peng-Fei; Shi, Ping-Ping; Zhao, Dewei; Xiong, Ren-Gen |
Journal of publication | Journal of the American Chemical Society |
Year of publication | 2018 |
Journal volume | 140 |
Journal issue | 38 |
Pages of publication | 12296 - 12302 |
a | 10.0802 ± 0.0005 Å |
b | 10.0802 ± 0.0005 Å |
c | 8.0696 ± 0.0005 Å |
α | 90° |
β | 90° |
γ | 120° |
Cell volume | 710.1 ± 0.07 Å3 |
Cell temperature | 298 ± 2 K |
Ambient diffraction temperature | 298 ± 2 K |
Number of distinct elements | 6 |
Space group number | 194 |
Hermann-Mauguin space group symbol | P 63/m m c |
Hall space group symbol | -P 6c 2c |
Residual factor for all reflections | 0.0549 |
Residual factor for significantly intense reflections | 0.0486 |
Weighted residual factors for significantly intense reflections | 0.16 |
Weighted residual factors for all reflections included in the refinement | 0.1686 |
Goodness-of-fit parameter for all reflections included in the refinement | 1.055 |
Diffraction radiation wavelength | 0.71073 Å |
Diffraction radiation type | MoKα |