Information card for entry 4133077
Formula | C24 H40 B2 F2 P2 Pt |
Calculated formula | C24 H40 B2 F2 P2 Pt |
SMILES | [Pt](B(F)F)([P](C)(C)C)([P](C)(C)C)B(c1c(cc(cc1C)C)C)c1c(cc(cc1C)C)C |
Title of publication | Reactivity of Tetrahalo- and Difluorodiboranes(4) toward Lewis Basic Platinum(0): Bis(boryl), Borylborato, and Doubly Boryl-Bridged Platinum Complexes. |
Authors of publication | Muessig, Jonas H.; Prieschl, Dominic; Deißenberger, Andrea; Dewhurst, Rian D.; Dietz, Maximilian; Jiménez-Halla, J Oscar C; Trumpp, Alexandra; Wang, Sunewang R.; Brunecker, Carina; Haefner, Alena; Gärtner, Annalena; Thiess, Torsten; Böhnke, Julian; Radacki, Krzysztof; Bertermann, Rüdiger; Marder, Todd B.; Braunschweig, Holger |
Journal of publication | Journal of the American Chemical Society |
Year of publication | 2018 |
Journal volume | 140 |
Journal issue | 40 |
Pages of publication | 13056 - 13063 |
a | 9.098 ± 0.003 Å |
b | 14.582 ± 0.004 Å |
c | 20.853 ± 0.003 Å |
α | 90° |
β | 99.45 ± 0.02° |
γ | 90° |
Cell volume | 2729 ± 1.2 Å3 |
Cell temperature | 100 ± 2 K |
Ambient diffraction temperature | 100 ± 2 K |
Number of distinct elements | 6 |
Space group number | 14 |
Hermann-Mauguin space group symbol | P 1 21/c 1 |
Hall space group symbol | -P 2ybc |
Residual factor for all reflections | 0.0271 |
Residual factor for significantly intense reflections | 0.021 |
Weighted residual factors for significantly intense reflections | 0.0476 |
Weighted residual factors for all reflections included in the refinement | 0.0496 |
Goodness-of-fit parameter for all reflections included in the refinement | 1.05 |
Diffraction radiation wavelength | 0.71073 Å |
Diffraction radiation type | MoKα |