Information card for entry 4133086
Mineral name |
MFM-601_SO2 |
Formula |
C44 H24 N2 O44.544 S14.272 Zr3 |
Calculated formula |
C44 H24 N2 O44.544 S14.272 Zr3 |
Title of publication |
Exceptional Adsorption and Binding of Sulfur Dioxide in a Robust Zirconium-Based Metal-Organic Framework. |
Authors of publication |
Carter, Joseph H.; Han, Xue; Moreau, Florian Y.; da Silva, Ivan; Nevin, Adam; Godfrey, Harry G. W.; Tang, Chiu C.; Yang, Sihai; Schröder, Martin |
Journal of publication |
Journal of the American Chemical Society |
Year of publication |
2018 |
Journal volume |
140 |
Journal issue |
46 |
Pages of publication |
15564 - 15567 |
a |
20.56 ± 0.0003 Å |
b |
20.56 ± 0.0003 Å |
c |
67.1128 ± 0.0011 Å |
α |
90° |
β |
90° |
γ |
90° |
Cell volume |
28369.5 ± 0.7 Å3 |
Cell temperature |
293 K |
Ambient diffraction temperature |
293 K |
Number of distinct elements |
6 |
Space group number |
141 |
Hermann-Mauguin space group symbol |
I 41/a m d :2 |
Hall space group symbol |
-I 4bd 2 |
Residual factor for all reflections |
3.10498 |
Goodness-of-fit parameter for all reflections |
2.76239 |
Method of determination |
powder diffraction |
Diffraction radiation wavelength |
0.826013 Å |
Diffraction radiation type |
synchrotron |
Yes |
No |
No |