Information card for entry 4133102
Formula | C51 H58 B Fe N5 O |
Calculated formula | C51 H58 B Fe N5 O |
SMILES | [Fe]123([N](=C(C)c4[n]1c(ccc4)C(=[N]2CC[N]13CCCC1)C)c1c(cccc1C(C)C)C(C)C)N=O.[B-](c1ccccc1)(c1ccccc1)(c1ccccc1)c1ccccc1 |
Title of publication | Hemilabile Proton Relays and Redox Activity Lead to {FeNO} <sup>x</sup> and Significant Rate Enhancements in NO<sub>2</sub><sup>-</sup> Reduction. |
Authors of publication | Cheung, Pui Man; Burns, Kyle T.; Kwon, Yubin M.; Deshaye, Megan Y.; Aguayo, Kristopher J.; Oswald, Victoria F.; Seda, Takele; Zakharov, Lev N.; Kowalczyk, Tim; Gilbertson, John D. |
Journal of publication | Journal of the American Chemical Society |
Year of publication | 2018 |
Journal volume | 140 |
Journal issue | 49 |
Pages of publication | 17040 - 17050 |
a | 11.3063 ± 0.0004 Å |
b | 14.0433 ± 0.0005 Å |
c | 14.6725 ± 0.0005 Å |
α | 81.601 ± 0.002° |
β | 85.289 ± 0.002° |
γ | 71.56 ± 0.002° |
Cell volume | 2184.75 ± 0.14 Å3 |
Cell temperature | 173 ± 2 K |
Ambient diffraction temperature | 173 ± 2 K |
Number of distinct elements | 6 |
Space group number | 2 |
Hermann-Mauguin space group symbol | P -1 |
Hall space group symbol | -P 1 |
Residual factor for all reflections | 0.0379 |
Residual factor for significantly intense reflections | 0.0355 |
Weighted residual factors for significantly intense reflections | 0.0963 |
Weighted residual factors for all reflections included in the refinement | 0.0976 |
Goodness-of-fit parameter for all reflections included in the refinement | 1.048 |
Diffraction radiation wavelength | 1.54178 Å |
Diffraction radiation type | CuKα |