Information card for entry 4133124
Common name | GaRhOPh |
Chemical name | GaRhOPh |
Formula | C33 H35 Ga N7 O Rh |
Calculated formula | C33 H35 Ga N7 O Rh |
Title of publication | Well-Defined Rhodium-Gallium Catalytic Sites in a Metal-Organic Framework: Promoter-Controlled Selectivity in Alkyne Semihydrogenation to E-Alkenes. |
Authors of publication | Desai, Sai Puneet; Ye, Jingyun; Zheng, Jian; Ferrandon, Magali S.; Webber, Thomas E.; Platero-Prats, Ana E; Duan, Jiaxin; Garcia-Holley, Paula; Camaioni, Donald M.; Chapman, Karena W.; Delferro, Massimiliano; Farha, Omar K.; Fulton, John L.; Gagliardi, Laura; Lercher, Johannes A.; Penn, R. Lee; Stein, Andreas; Lu, Connie C. |
Journal of publication | Journal of the American Chemical Society |
Year of publication | 2018 |
Journal volume | 140 |
Journal issue | 45 |
Pages of publication | 15309 - 15318 |
a | 9.091 ± 0.007 Å |
b | 13.501 ± 0.01 Å |
c | 24.173 ± 0.017 Å |
α | 90° |
β | 92.202 ± 0.009° |
γ | 90° |
Cell volume | 2965 ± 4 Å3 |
Cell temperature | 123 ± 2 K |
Ambient diffraction temperature | 123 ± 2 K |
Number of distinct elements | 6 |
Space group number | 14 |
Hermann-Mauguin space group symbol | P 1 21/n 1 |
Hall space group symbol | -P 2yn |
Residual factor for all reflections | 0.0406 |
Residual factor for significantly intense reflections | 0.0292 |
Weighted residual factors for significantly intense reflections | 0.0634 |
Weighted residual factors for all reflections included in the refinement | 0.0687 |
Goodness-of-fit parameter for all reflections included in the refinement | 1.029 |
Diffraction radiation wavelength | 0.71073 Å |
Diffraction radiation type | MoKα |