Information card for entry 4133141
Formula | C20 H17 N5 O2 |
Calculated formula | C20 H17 N5 O2 |
SMILES | c1(cccc(C(=O)N/N=C/c2ccccn2)n1)C(=O)NCc1ccccc1 |
Title of publication | A Photoswitchable Heteroditopic Ion-Pair Receptor. |
Authors of publication | Kokan, Zoran; Chmielewski, Michał J |
Journal of publication | Journal of the American Chemical Society |
Year of publication | 2018 |
Journal volume | 140 |
Journal issue | 47 |
Pages of publication | 16010 - 16014 |
a | 7.44527 ± 0.00012 Å |
b | 9.34308 ± 0.00012 Å |
c | 30.9935 ± 0.0005 Å |
α | 90° |
β | 94.8031 ± 0.0015° |
γ | 90° |
Cell volume | 2148.39 ± 0.06 Å3 |
Cell temperature | 100 ± 2 K |
Ambient diffraction temperature | 100 ± 2 K |
Number of distinct elements | 4 |
Space group number | 14 |
Hermann-Mauguin space group symbol | P 1 21/n 1 |
Hall space group symbol | -P 2yn |
Residual factor for all reflections | 0.0527 |
Residual factor for significantly intense reflections | 0.0513 |
Weighted residual factors for significantly intense reflections | 0.1242 |
Weighted residual factors for all reflections included in the refinement | 0.1249 |
Goodness-of-fit parameter for all reflections included in the refinement | 1.165 |
Diffraction radiation probe | x-ray |
Diffraction radiation wavelength | 1.54184 Å |
Diffraction radiation type | CuKα |