Information card for entry 4133145
Formula | C6 H16 Br4 N2 Pb |
Calculated formula | C6 H16 Br4 N2 Pb |
Title of publication | Structural Diversity in White-Light-Emitting Hybrid Lead Bromide Perovskites. |
Authors of publication | Mao, Lingling; Guo, Peijun; Kepenekian, Mikaël; Hadar, Ido; Katan, Claudine; Even, Jacky; Schaller, Richard D.; Stoumpos, Constantinos C.; Kanatzidis, Mercouri G. |
Journal of publication | Journal of the American Chemical Society |
Year of publication | 2018 |
Journal volume | 140 |
Journal issue | 40 |
Pages of publication | 13078 - 13088 |
a | 10.536 ± 0.002 Å |
b | 12.415 ± 0.002 Å |
c | 16.43 ± 0.003 Å |
α | 90° |
β | 96.77 ± 0.03° |
γ | 90° |
Cell volume | 2134.1 ± 0.7 Å3 |
Cell temperature | 293 ± 2 K |
Ambient diffraction temperature | 293 ± 2 K |
Number of distinct elements | 5 |
Space group number | 7 |
Hermann-Mauguin space group symbol | P 1 c 1 |
Hall space group symbol | P -2yc |
Residual factor for all reflections | 0.137 |
Residual factor for significantly intense reflections | 0.0575 |
Weighted residual factors for significantly intense reflections | 0.1332 |
Weighted residual factors for all reflections included in the refinement | 0.1807 |
Goodness-of-fit parameter for all reflections included in the refinement | 0.862 |
Diffraction radiation wavelength | 0.71073 Å |
Diffraction radiation type | MoKα |