Information card for entry 4133147
Formula | C5 H14 Br4 N2 Pb |
Calculated formula | C5 H14 Br4 N2 Pb |
Title of publication | Structural Diversity in White-Light-Emitting Hybrid Lead Bromide Perovskites. |
Authors of publication | Mao, Lingling; Guo, Peijun; Kepenekian, Mikaël; Hadar, Ido; Katan, Claudine; Even, Jacky; Schaller, Richard D.; Stoumpos, Constantinos C.; Kanatzidis, Mercouri G. |
Journal of publication | Journal of the American Chemical Society |
Year of publication | 2018 |
Journal volume | 140 |
Journal issue | 40 |
Pages of publication | 13078 - 13088 |
a | 28.452 ± 0.006 Å |
b | 12.218 ± 0.002 Å |
c | 15.839 ± 0.003 Å |
α | 90° |
β | 104.93 ± 0.03° |
γ | 90° |
Cell volume | 5320.2 ± 1.9 Å3 |
Cell temperature | 293 ± 2 K |
Ambient diffraction temperature | 293 ± 2 K |
Number of distinct elements | 5 |
Space group number | 12 |
Hermann-Mauguin space group symbol | C 1 2/m 1 |
Hall space group symbol | -C 2y |
Residual factor for all reflections | 0.0914 |
Residual factor for significantly intense reflections | 0.0566 |
Weighted residual factors for significantly intense reflections | 0.1289 |
Weighted residual factors for all reflections included in the refinement | 0.1467 |
Goodness-of-fit parameter for all reflections included in the refinement | 1.053 |
Diffraction radiation wavelength | 0.71073 Å |
Diffraction radiation type | MoKα |