Information card for entry 4133173
Formula | C64 H86 Cu K2 N14 O10 |
Calculated formula | C64 H86 Cu K2 N14 O10 |
Title of publication | Catalytic Aerobic Oxidation of Alcohols by Copper Complexes Bearing Redox-Active Ligands with Tunable H-Bonding Groups. |
Authors of publication | Rajabimoghadam, Khashayar; Darwish, Yousef; Bashir, Umyeena; Pitman, Dylan; Eichelberger, Sidney; Siegler, Maxime A.; Swart, Marcel; Garcia-Bosch, Isaac |
Journal of publication | Journal of the American Chemical Society |
Year of publication | 2018 |
Journal volume | 140 |
Journal issue | 48 |
Pages of publication | 16625 - 16634 |
a | 13.8966 ± 0.0003 Å |
b | 14.4757 ± 0.0003 Å |
c | 18.7995 ± 0.0004 Å |
α | 83.2946 ± 0.0019° |
β | 78.288 ± 0.002° |
γ | 72.69 ± 0.002° |
Cell volume | 3528.88 ± 0.14 Å3 |
Cell temperature | 200 ± 2 K |
Ambient diffraction temperature | 200 ± 2 K |
Number of distinct elements | 6 |
Space group number | 2 |
Hermann-Mauguin space group symbol | P -1 |
Hall space group symbol | -P 1 |
Residual factor for all reflections | 0.0535 |
Residual factor for significantly intense reflections | 0.0374 |
Weighted residual factors for significantly intense reflections | 0.0859 |
Weighted residual factors for all reflections included in the refinement | 0.0939 |
Goodness-of-fit parameter for all reflections included in the refinement | 1.023 |
Diffraction radiation wavelength | 0.71073 Å |
Diffraction radiation type | MoKα |