Information card for entry 4133186
Formula | C54 H98 N2 O19 S2 V6 |
Calculated formula | C54 H98 N2 O19 S2 V6 |
Title of publication | Addressing Multiple Resistive States of Polyoxovanadates: Conductivity as a Function of Individual Molecular Redox States. |
Authors of publication | Linnenberg, Oliver; Moors, Marco; Notario-Estévez, Almudena; López, Xavier; de Graaf, Coen; Peter, Sophia; Baeumer, Christoph; Waser, Rainer; Monakhov, Kirill Yu |
Journal of publication | Journal of the American Chemical Society |
Year of publication | 2018 |
Journal volume | 140 |
Journal issue | 48 |
Pages of publication | 16635 - 16640 |
a | 10.7421 ± 0.0015 Å |
b | 18.328 ± 0.003 Å |
c | 16.454 ± 0.002 Å |
α | 90° |
β | 90.571 ± 0.003° |
γ | 90° |
Cell volume | 3239.3 ± 0.8 Å3 |
Cell temperature | 100 ± 2 K |
Ambient diffraction temperature | 100 ± 2 K |
Number of distinct elements | 6 |
Space group number | 14 |
Hermann-Mauguin space group symbol | P 1 21/c 1 |
Hall space group symbol | -P 2ybc |
Residual factor for all reflections | 0.0676 |
Residual factor for significantly intense reflections | 0.0428 |
Weighted residual factors for significantly intense reflections | 0.1088 |
Weighted residual factors for all reflections included in the refinement | 0.1141 |
Goodness-of-fit parameter for all reflections included in the refinement | 0.958 |
Diffraction radiation wavelength | 0.71073 Å |
Diffraction radiation type | MoKα |