Information card for entry 4133190
Formula | C62 H102 N2 O19 S2 V6 |
Calculated formula | C62.444 H86.298 N2 O19 S2 V6 |
Title of publication | Addressing Multiple Resistive States of Polyoxovanadates: Conductivity as a Function of Individual Molecular Redox States. |
Authors of publication | Linnenberg, Oliver; Moors, Marco; Notario-Estévez, Almudena; López, Xavier; de Graaf, Coen; Peter, Sophia; Baeumer, Christoph; Waser, Rainer; Monakhov, Kirill Yu |
Journal of publication | Journal of the American Chemical Society |
Year of publication | 2018 |
Journal volume | 140 |
Journal issue | 48 |
Pages of publication | 16635 - 16640 |
a | 12.3292 ± 0.001 Å |
b | 24.206 ± 0.002 Å |
c | 23.3258 ± 0.0019 Å |
α | 90° |
β | 91.057 ± 0.002° |
γ | 90° |
Cell volume | 6960.2 ± 1 Å3 |
Cell temperature | 100 ± 2 K |
Ambient diffraction temperature | 100 ± 2 K |
Number of distinct elements | 6 |
Space group number | 15 |
Hermann-Mauguin space group symbol | C 1 2/c 1 |
Hall space group symbol | -C 2yc |
Residual factor for all reflections | 0.1121 |
Residual factor for significantly intense reflections | 0.0633 |
Weighted residual factors for significantly intense reflections | 0.1531 |
Weighted residual factors for all reflections included in the refinement | 0.1802 |
Goodness-of-fit parameter for all reflections included in the refinement | 1.025 |
Diffraction radiation wavelength | 0.71073 Å |
Diffraction radiation type | MoKα |