Information card for entry 4133218
Formula | C68 H70 Co N O P V |
Calculated formula | C68 H70 Co N4 O P V |
Title of publication | Probing Hydrogen Atom Transfer at a Phosphorus(V) Oxide Bond Using a "Bulky Hydrogen Atom" Surrogate: Analogies to PCET. |
Authors of publication | Chu, Jiaxiang; Carroll, Timothy G.; Wu, Guang; Telser, Joshua; Dobrovetsky, Roman; Ménard, Gabriel |
Journal of publication | Journal of the American Chemical Society |
Year of publication | 2018 |
Journal volume | 140 |
Journal issue | 45 |
Pages of publication | 15375 - 15383 |
a | 13.07 ± 0.004 Å |
b | 26.267 ± 0.009 Å |
c | 33.074 ± 0.011 Å |
α | 90° |
β | 90.71 ± 0.02° |
γ | 90° |
Cell volume | 11354 ± 6 Å3 |
Cell temperature | 100 ± 2 K |
Ambient diffraction temperature | 100 ± 2 K |
Number of distinct elements | 7 |
Space group number | 14 |
Hermann-Mauguin space group symbol | P 1 21/c 1 |
Hall space group symbol | -P 2ybc |
Residual factor for all reflections | 0.3452 |
Residual factor for significantly intense reflections | 0.0997 |
Weighted residual factors for significantly intense reflections | 0.112 |
Weighted residual factors for all reflections included in the refinement | 0.1749 |
Goodness-of-fit parameter for all reflections included in the refinement | 0.937 |
Diffraction radiation wavelength | 0.71073 Å |
Diffraction radiation type | MoKα |