Information card for entry 4133227
Formula | Co8 Fe8 Na13 O233 P4 Si4 W36 |
Calculated formula | Co8 Fe8 Na13 O233 P4 Si4 W36 |
Title of publication | Ultrasmall Abundant Metal-Based Clusters as Oxygen-Evolving Catalysts. |
Authors of publication | Han, Xin-Bao; Tang, Xing-Yan; Lin, Yue; Gracia-Espino, Eduardo; Liu, San-Gui; Liang, Hai-Wei; Hu, Guang-Zhi; Zhao, Xin-Jing; Liao, Hong-Gang; Tan, Yuan-Zhi; Wagberg, Thomas; Xie, Su-Yuan; Zheng, Lan-Sun |
Journal of publication | Journal of the American Chemical Society |
Year of publication | 2019 |
Journal volume | 141 |
Journal issue | 1 |
Pages of publication | 232 - 239 |
a | 25.9719 ± 0.0005 Å |
b | 23.5149 ± 0.0006 Å |
c | 18.9224 ± 0.0003 Å |
α | 90° |
β | 90° |
γ | 90° |
Cell volume | 11556.4 ± 0.4 Å3 |
Cell temperature | 150.01 ± 0.1 K |
Ambient diffraction temperature | 150.01 ± 0.1 K |
Number of distinct elements | 7 |
Space group number | 59 |
Hermann-Mauguin space group symbol | P m m n :2 |
Hall space group symbol | -P 2ab 2a |
Residual factor for all reflections | 0.0809 |
Residual factor for significantly intense reflections | 0.0644 |
Weighted residual factors for significantly intense reflections | 0.1731 |
Weighted residual factors for all reflections included in the refinement | 0.1903 |
Goodness-of-fit parameter for all reflections included in the refinement | 1.055 |
Diffraction radiation wavelength | 1.54184 Å |
Diffraction radiation type | CuKα |