Information card for entry 4133229
Formula | C13 H19 K O |
Calculated formula | C13 H19 K O |
Title of publication | Lanthanidocenes: Synthesis, Structure, and Bonding of Linear Sandwich Complexes of Lanthanides. |
Authors of publication | Xémard, Mathieu; Zimmer, Sébastien; Cordier, Marie; Goudy, Violaine; Ricard, Louis; Clavaguéra, Carine; Nocton, Grégory |
Journal of publication | Journal of the American Chemical Society |
Year of publication | 2018 |
Journal volume | 140 |
Journal issue | 43 |
Pages of publication | 14433 - 14439 |
a | 7.654 ± 0.0004 Å |
b | 17.305 ± 0.0009 Å |
c | 10.5413 ± 0.0006 Å |
α | 90° |
β | 107.269 ± 0.002° |
γ | 90° |
Cell volume | 1333.28 ± 0.13 Å3 |
Cell temperature | 150 ± 0.1 K |
Ambient diffraction temperature | 150 ± 2 K |
Number of distinct elements | 4 |
Space group number | 14 |
Hermann-Mauguin space group symbol | P 1 21/n 1 |
Hall space group symbol | -P 2yn |
Residual factor for all reflections | 0.0662 |
Residual factor for significantly intense reflections | 0.0536 |
Weighted residual factors for significantly intense reflections | 0.1534 |
Weighted residual factors for all reflections included in the refinement | 0.166 |
Goodness-of-fit parameter for all reflections included in the refinement | 1.051 |
Diffraction radiation wavelength | 0.71069 Å |
Diffraction radiation type | MoKα |