Information card for entry 4133238
Formula | C55 H76 O |
Calculated formula | C55.0028 H76.0038 O1.00005 |
Title of publication | Probing the Delicate Balance between Pauli Repulsion and London Dispersion with Triphenylmethyl Derivatives. |
Authors of publication | Rösel, Sören; Becker, Jonathan; Allen, Wesley D.; Schreiner, Peter R. |
Journal of publication | Journal of the American Chemical Society |
Year of publication | 2018 |
Journal volume | 140 |
Journal issue | 43 |
Pages of publication | 14421 - 14432 |
a | 20.4549 ± 0.0005 Å |
b | 19.4089 ± 0.0005 Å |
c | 23.0083 ± 0.0006 Å |
α | 90° |
β | 94.7795 ± 0.0014° |
γ | 90° |
Cell volume | 9102.7 ± 0.4 Å3 |
Cell temperature | 100 ± 2 K |
Ambient diffraction temperature | 100 ± 2 K |
Number of distinct elements | 3 |
Space group number | 14 |
Hermann-Mauguin space group symbol | P 1 21/c 1 |
Hall space group symbol | -P 2ybc |
Residual factor for all reflections | 0.1131 |
Residual factor for significantly intense reflections | 0.104 |
Weighted residual factors for significantly intense reflections | 0.2985 |
Weighted residual factors for all reflections included in the refinement | 0.3092 |
Goodness-of-fit parameter for all reflections included in the refinement | 1.038 |
Diffraction radiation wavelength | 1.54178 Å |
Diffraction radiation type | CuKα |