Information card for entry 4133240
Formula | C140 H108 O2 |
Calculated formula | C140 H108 O2 |
Title of publication | Probing the Delicate Balance between Pauli Repulsion and London Dispersion with Triphenylmethyl Derivatives. |
Authors of publication | Rösel, Sören; Becker, Jonathan; Allen, Wesley D.; Schreiner, Peter R. |
Journal of publication | Journal of the American Chemical Society |
Year of publication | 2018 |
Journal volume | 140 |
Journal issue | 43 |
Pages of publication | 14421 - 14432 |
a | 13.8958 ± 0.0005 Å |
b | 14.0534 ± 0.0005 Å |
c | 14.3343 ± 0.0005 Å |
α | 77.366 ± 0.0014° |
β | 70.7236 ± 0.0013° |
γ | 78.8692 ± 0.0014° |
Cell volume | 2556.05 ± 0.16 Å3 |
Cell temperature | 100 ± 2 K |
Ambient diffraction temperature | 100 ± 2 K |
Number of distinct elements | 3 |
Space group number | 2 |
Hermann-Mauguin space group symbol | P -1 |
Hall space group symbol | -P 1 |
Residual factor for all reflections | 0.0709 |
Residual factor for significantly intense reflections | 0.0481 |
Weighted residual factors for significantly intense reflections | 0.1046 |
Weighted residual factors for all reflections included in the refinement | 0.1149 |
Goodness-of-fit parameter for all reflections included in the refinement | 1.042 |
Diffraction radiation wavelength | 0.71073 Å |
Diffraction radiation type | MoKα |