Information card for entry 4133242
Formula | C55 H76 |
Calculated formula | C55 H76 |
Title of publication | Probing the Delicate Balance between Pauli Repulsion and London Dispersion with Triphenylmethyl Derivatives. |
Authors of publication | Rösel, Sören; Becker, Jonathan; Allen, Wesley D.; Schreiner, Peter R. |
Journal of publication | Journal of the American Chemical Society |
Year of publication | 2018 |
Journal volume | 140 |
Journal issue | 43 |
Pages of publication | 14421 - 14432 |
a | 15.5467 ± 0.0015 Å |
b | 15.551 ± 0.0015 Å |
c | 20.3357 ± 0.0019 Å |
α | 69.259 ± 0.003° |
β | 86.608 ± 0.003° |
γ | 81.081 ± 0.003° |
Cell volume | 4542.2 ± 0.8 Å3 |
Cell temperature | 101 ± 2 K |
Ambient diffraction temperature | 101 ± 2 K |
Number of distinct elements | 2 |
Space group number | 2 |
Hermann-Mauguin space group symbol | P -1 |
Hall space group symbol | -P 1 |
Residual factor for all reflections | 0.1266 |
Residual factor for significantly intense reflections | 0.0909 |
Weighted residual factors for significantly intense reflections | 0.2416 |
Weighted residual factors for all reflections included in the refinement | 0.2663 |
Goodness-of-fit parameter for all reflections included in the refinement | 1.06 |
Diffraction radiation wavelength | 0.71073 Å |
Diffraction radiation type | MoKα |