Information card for entry 4133244
Formula | C26 H33 I |
Calculated formula | C26 H33 I |
SMILES | Ic1cc(cc(c1)C12CC3CC(C1)CC(C2)C3)C12CC3CC(C1)CC(C2)C3 |
Title of publication | Probing the Delicate Balance between Pauli Repulsion and London Dispersion with Triphenylmethyl Derivatives. |
Authors of publication | Rösel, Sören; Becker, Jonathan; Allen, Wesley D.; Schreiner, Peter R. |
Journal of publication | Journal of the American Chemical Society |
Year of publication | 2018 |
Journal volume | 140 |
Journal issue | 43 |
Pages of publication | 14421 - 14432 |
a | 18.4517 ± 0.001 Å |
b | 38.562 ± 0.002 Å |
c | 11.4056 ± 0.0006 Å |
α | 90° |
β | 90° |
γ | 90° |
Cell volume | 8115.5 ± 0.7 Å3 |
Cell temperature | 100 ± 2 K |
Ambient diffraction temperature | 100 ± 2 K |
Number of distinct elements | 3 |
Space group number | 43 |
Hermann-Mauguin space group symbol | F d d 2 |
Hall space group symbol | F 2 -2d |
Residual factor for all reflections | 0.0187 |
Residual factor for significantly intense reflections | 0.0183 |
Weighted residual factors for significantly intense reflections | 0.041 |
Weighted residual factors for all reflections included in the refinement | 0.0411 |
Goodness-of-fit parameter for all reflections included in the refinement | 1.23 |
Diffraction radiation wavelength | 0.71073 Å |
Diffraction radiation type | MoKα |