Information card for entry 4133255
Formula | C70 H72 N2 O12 |
Calculated formula | C70 H72 N2 O12 |
Title of publication | Molecular Recognition of Hydrophilic Molecules in Water by Combining the Hydrophobic Effect with Hydrogen Bonding. |
Authors of publication | Yao, Huan; Ke, Hua; Zhang, Xiaobin; Pan, San-Jiang; Li, Ming-Shuang; Yang, Liu-Pan; Schreckenbach, Georg; Jiang, Wei |
Journal of publication | Journal of the American Chemical Society |
Year of publication | 2018 |
Journal volume | 140 |
Journal issue | 41 |
Pages of publication | 13466 - 13477 |
a | 11.8324 ± 0.0005 Å |
b | 11.8564 ± 0.0004 Å |
c | 12.4505 ± 0.0005 Å |
α | 93.443 ± 0.002° |
β | 91.068 ± 0.002° |
γ | 105.257 ± 0.002° |
Cell volume | 1681 ± 0.11 Å3 |
Cell temperature | 150 K |
Ambient diffraction temperature | 150 K |
Number of distinct elements | 4 |
Space group number | 2 |
Hermann-Mauguin space group symbol | P -1 |
Hall space group symbol | -P 1 |
Residual factor for all reflections | 0.0756 |
Residual factor for significantly intense reflections | 0.0527 |
Weighted residual factors for significantly intense reflections | 0.1293 |
Weighted residual factors for all reflections included in the refinement | 0.1418 |
Goodness-of-fit parameter for all reflections included in the refinement | 1.04 |
Diffraction radiation wavelength | 1.54178 Å |
Diffraction radiation type | CuKα |