Information card for entry 4133266
Formula | C70 H70 N4 O10 |
Calculated formula | C70 H70 N4 O10 |
Title of publication | Molecular Recognition of Hydrophilic Molecules in Water by Combining the Hydrophobic Effect with Hydrogen Bonding. |
Authors of publication | Yao, Huan; Ke, Hua; Zhang, Xiaobin; Pan, San-Jiang; Li, Ming-Shuang; Yang, Liu-Pan; Schreckenbach, Georg; Jiang, Wei |
Journal of publication | Journal of the American Chemical Society |
Year of publication | 2018 |
Journal volume | 140 |
Journal issue | 41 |
Pages of publication | 13466 - 13477 |
a | 11.856 ± 0.0005 Å |
b | 11.8594 ± 0.0005 Å |
c | 12.5172 ± 0.0005 Å |
α | 89.974 ± 0.002° |
β | 86.799 ± 0.002° |
γ | 73.599 ± 0.002° |
Cell volume | 1685.52 ± 0.12 Å3 |
Cell temperature | 150 K |
Ambient diffraction temperature | 150.01 K |
Number of distinct elements | 4 |
Space group number | 2 |
Hermann-Mauguin space group symbol | P -1 |
Hall space group symbol | -P 1 |
Residual factor for all reflections | 0.0492 |
Residual factor for significantly intense reflections | 0.044 |
Weighted residual factors for significantly intense reflections | 0.1125 |
Weighted residual factors for all reflections included in the refinement | 0.1167 |
Goodness-of-fit parameter for all reflections included in the refinement | 1.036 |
Diffraction radiation wavelength | 1.54178 Å |
Diffraction radiation type | CuKα |