Information card for entry 4133269
Formula | C72 H72 N4 O10 S2 |
Calculated formula | C72 H72 N4 O10 S2 |
Title of publication | Molecular Recognition of Hydrophilic Molecules in Water by Combining the Hydrophobic Effect with Hydrogen Bonding. |
Authors of publication | Yao, Huan; Ke, Hua; Zhang, Xiaobin; Pan, San-Jiang; Li, Ming-Shuang; Yang, Liu-Pan; Schreckenbach, Georg; Jiang, Wei |
Journal of publication | Journal of the American Chemical Society |
Year of publication | 2018 |
Journal volume | 140 |
Journal issue | 41 |
Pages of publication | 13466 - 13477 |
a | 17.764 ± 0.0006 Å |
b | 15.6487 ± 0.0006 Å |
c | 24.7929 ± 0.0009 Å |
α | 90° |
β | 92.274 ± 0.002° |
γ | 90° |
Cell volume | 6886.6 ± 0.4 Å3 |
Cell temperature | 160 K |
Ambient diffraction temperature | 160 K |
Number of distinct elements | 5 |
Space group number | 14 |
Hermann-Mauguin space group symbol | P 1 21/c 1 |
Hall space group symbol | -P 2ybc |
Residual factor for all reflections | 0.1025 |
Residual factor for significantly intense reflections | 0.0827 |
Weighted residual factors for significantly intense reflections | 0.2361 |
Weighted residual factors for all reflections included in the refinement | 0.2562 |
Goodness-of-fit parameter for all reflections included in the refinement | 1.022 |
Diffraction radiation wavelength | 1.54178 Å |
Diffraction radiation type | CuKα |