Information card for entry 4133297
Formula | C67 H72 B F24 P2 Rh |
Calculated formula | C67 H72 B F24 P2 Rh |
Title of publication | Modulation of σ-Alkane Interactions in [Rh(L<sub>2</sub>)(alkane)]<sup>+</sup> Solid-State Molecular Organometallic (SMOM) Systems by Variation of the Chelating Phosphine and Alkane: Access to η<sup>2</sup>,η<sup>2</sup>-σ-Alkane Rh(I), η<sup>1</sup>-σ-Alkane Rh(III) Complexes, and Alkane Encapsulation. |
Authors of publication | Martínez-Martínez, Antonio J; Tegner, Bengt E.; McKay, Alasdair I.; Bukvic, Alexander J.; Rees, Nicholas H.; Tizzard, Graham J.; Coles, Simon J.; Warren, Mark R.; Macgregor, Stuart A.; Weller, Andrew S. |
Journal of publication | Journal of the American Chemical Society |
Year of publication | 2018 |
Journal volume | 140 |
Journal issue | 44 |
Pages of publication | 14958 - 14970 |
a | 19.47695 ± 0.00014 Å |
b | 17.24051 ± 0.00012 Å |
c | 20.25038 ± 0.00014 Å |
α | 90° |
β | 94.11 ± 0.0007° |
γ | 90° |
Cell volume | 6782.44 ± 0.08 Å3 |
Cell temperature | 149.9 ± 0.3 K |
Ambient diffraction temperature | 149.9 ± 0.3 K |
Number of distinct elements | 6 |
Space group number | 15 |
Hermann-Mauguin space group symbol | C 1 2/c 1 |
Hall space group symbol | -C 2yc |
Residual factor for all reflections | 0.0538 |
Residual factor for significantly intense reflections | 0.0513 |
Weighted residual factors for significantly intense reflections | 0.1354 |
Weighted residual factors for all reflections included in the refinement | 0.1382 |
Goodness-of-fit parameter for all reflections included in the refinement | 1.058 |
Diffraction radiation probe | x-ray |
Diffraction radiation wavelength | 1.54184 Å |
Diffraction radiation type | CuKα |