Information card for entry 4133309
Formula | C12 H15 N O3 |
Calculated formula | C12 H15 N O3 |
SMILES | N1C(=O)O[C@H]([C@H]1c1ccccc1)CCCO |
Title of publication | Catalytic Asymmetric Construction of Halogenated Stereogenic Carbon Centers by Direct Vinylogous Mannich-Type Reaction. |
Authors of publication | Zhong, Feng; Yue, Wen-Jun; Zhang, Hai-Jun; Zhang, Cheng-Yuan; Yin, Liang |
Journal of publication | Journal of the American Chemical Society |
Year of publication | 2018 |
Journal volume | 140 |
Journal issue | 45 |
Pages of publication | 15170 - 15175 |
a | 5.5125 ± 0.0001 Å |
b | 13.5718 ± 0.0003 Å |
c | 14.9 ± 0.0003 Å |
α | 90° |
β | 90° |
γ | 90° |
Cell volume | 1114.74 ± 0.04 Å3 |
Cell temperature | 296 ± 2 K |
Ambient diffraction temperature | 296 ± 2 K |
Number of distinct elements | 4 |
Space group number | 19 |
Hermann-Mauguin space group symbol | P 21 21 21 |
Hall space group symbol | P 2ac 2ab |
Residual factor for all reflections | 0.0341 |
Residual factor for significantly intense reflections | 0.0334 |
Weighted residual factors for significantly intense reflections | 0.0887 |
Weighted residual factors for all reflections included in the refinement | 0.0898 |
Goodness-of-fit parameter for all reflections included in the refinement | 1.102 |
Diffraction radiation wavelength | 1.54178 Å |
Diffraction radiation type | CuKα |