Information card for entry 4133363
Formula | C61 H96 N P Th |
Calculated formula | C61 H96 N P Th |
SMILES | [c]12([c]3([cH]4[c]5([cH]1[Th]167892345([c]2([c]1([cH]6[c]7([cH]82)C(C)(C)C)C(C)(C)C)C(C)(C)C)C(=[N]9c1c(cccc1C)C)=Pc1c(cc(cc1C(C)(C)C)C(C)(C)C)C(C)(C)C)C(C)(C)C)C(C)(C)C)C(C)(C)C |
Title of publication | A Base-Free Terminal Actinide Phosphinidene Metallocene: Synthesis, Structure, Reactivity, and Computational Studies. |
Authors of publication | Zhang, Congcong; Hou, Guohua; Zi, Guofu; Ding, Wanjian; Walter, Marc D. |
Journal of publication | Journal of the American Chemical Society |
Year of publication | 2018 |
Journal volume | 140 |
Journal issue | 43 |
Pages of publication | 14511 - 14525 |
a | 13.3682 ± 0.0004 Å |
b | 14.9534 ± 0.0005 Å |
c | 16.5128 ± 0.0005 Å |
α | 105.788 ± 0.003° |
β | 90.91 ± 0.002° |
γ | 94.865 ± 0.002° |
Cell volume | 3162.33 ± 0.18 Å3 |
Cell temperature | 100.01 ± 0.1 K |
Ambient diffraction temperature | 100.01 ± 0.1 K |
Number of distinct elements | 5 |
Space group number | 2 |
Hermann-Mauguin space group symbol | P -1 |
Hall space group symbol | -P 1 |
Residual factor for all reflections | 0.027 |
Residual factor for significantly intense reflections | 0.0252 |
Weighted residual factors for significantly intense reflections | 0.0546 |
Weighted residual factors for all reflections included in the refinement | 0.0559 |
Goodness-of-fit parameter for all reflections included in the refinement | 1.019 |
Diffraction radiation probe | x-ray |
Diffraction radiation wavelength | 1.54184 Å |
Diffraction radiation type | CuKα |