Information card for entry 4133377
Formula | C74 H90 Al2 N4 O9 W |
Calculated formula | C74 H90 Al2 N4 O9 W |
Title of publication | Carbon Chain Growth by Sequential Reactions of CO and CO<sub>2</sub> with [W(CO)<sub>6</sub>] and an Aluminum(I) Reductant. |
Authors of publication | Kong, Richard Y.; Crimmin, Mark R. |
Journal of publication | Journal of the American Chemical Society |
Year of publication | 2018 |
Journal volume | 140 |
Journal issue | 42 |
Pages of publication | 13614 - 13617 |
a | 15.3318 ± 0.0003 Å |
b | 21.4894 ± 0.0003 Å |
c | 21.5498 ± 0.0003 Å |
α | 90° |
β | 92.4806 ± 0.0014° |
γ | 90° |
Cell volume | 7093.4 ± 0.2 Å3 |
Cell temperature | 173 ± 0.14 K |
Ambient diffraction temperature | 173 ± 0.14 K |
Number of distinct elements | 6 |
Space group number | 14 |
Hermann-Mauguin space group symbol | P 1 21/c 1 |
Hall space group symbol | -P 2ybc |
Residual factor for all reflections | 0.061 |
Residual factor for significantly intense reflections | 0.0422 |
Weighted residual factors for significantly intense reflections | 0.1017 |
Weighted residual factors for all reflections included in the refinement | 0.1149 |
Goodness-of-fit parameter for all reflections included in the refinement | 1 |
Diffraction radiation probe | x-ray |
Diffraction radiation wavelength | 1.54184 Å |
Diffraction radiation type | CuKα |