Information card for entry 4133637
Formula | C54 H26 Cl22 N12 O12 |
Calculated formula | C54 H26 Cl22 N12 O12 |
Title of publication | Toward Anion-π Interactions Directed Self-Assembly with Predesigned Dual Macrocyclic Receptors and Dianions. |
Authors of publication | Tuo, De-Hui; Liu, Wei; Wang, Xue-Yuan; Wang, Xu-Dong; Ao, Yu-Fei; Wang, Qi-Qiang; Li, Zhi-Yan; Wang, De-Xian |
Journal of publication | Journal of the American Chemical Society |
Year of publication | 2019 |
Journal volume | 141 |
Journal issue | 2 |
Pages of publication | 1118 - 1125 |
a | 10.035 ± 0.003 Å |
b | 21.931 ± 0.007 Å |
c | 17.509 ± 0.006 Å |
α | 90° |
β | 94.079 ± 0.005° |
γ | 90° |
Cell volume | 3844 ± 2 Å3 |
Cell temperature | 173.15 K |
Ambient diffraction temperature | 173.15 K |
Number of distinct elements | 5 |
Space group number | 14 |
Hermann-Mauguin space group symbol | P 1 21/c 1 |
Hall space group symbol | -P 2ybc |
Residual factor for all reflections | 0.1157 |
Residual factor for significantly intense reflections | 0.1023 |
Weighted residual factors for significantly intense reflections | 0.2567 |
Weighted residual factors for all reflections included in the refinement | 0.2666 |
Goodness-of-fit parameter for all reflections included in the refinement | 1.151 |
Diffraction radiation wavelength | 0.71073 Å |
Diffraction radiation type | MoKα |