Information card for entry 4133724
Common name | Co2(dobdc)(1-butene)1.59 |
Formula | C14.36 H14.71 Co2 O6 |
Calculated formula | C14.36 H14.72 Co2 O6 |
Title of publication | Thermodynamic Separation of 1-Butene from 2-Butene in Metal-Organic Frameworks with Open Metal Sites. |
Authors of publication | Barnett, Brandon R.; Parker, Surya T.; Paley, Maria V.; Gonzalez, Miguel I.; Biggins, Naomi; Oktawiec, Julia; Long, Jeffrey R. |
Journal of publication | Journal of the American Chemical Society |
Year of publication | 2019 |
Journal volume | 141 |
Journal issue | 45 |
Pages of publication | 18325 - 18333 |
a | 25.8095 ± 0.0009 Å |
b | 25.8095 ± 0.0009 Å |
c | 6.8241 ± 0.0003 Å |
α | 90° |
β | 90° |
γ | 120° |
Cell volume | 3936.7 ± 0.3 Å3 |
Cell temperature | 100 ± 2 K |
Ambient diffraction temperature | 100 ± 2 K |
Number of distinct elements | 4 |
Space group number | 148 |
Hermann-Mauguin space group symbol | R -3 :H |
Hall space group symbol | -R 3 |
Residual factor for all reflections | 0.0465 |
Residual factor for significantly intense reflections | 0.0438 |
Weighted residual factors for significantly intense reflections | 0.1235 |
Weighted residual factors for all reflections included in the refinement | 0.1253 |
Goodness-of-fit parameter for all reflections included in the refinement | 1.074 |
Diffraction radiation wavelength | 0.7749 Å |
Diffraction radiation type | synchrotron |