Information card for entry 4133747
Formula | C32 H29 Au F3 N3 O3 S |
Calculated formula | C32 H29 Au F3 N3 O3 S |
SMILES | [Au]12(c3ccccc3c3[n]1c(ccc3)c1ccccc21)C#Cc1ccc(cc1)C[N+](C)(C)C.S(=O)(=O)([O-])C(F)(F)F.N#CC |
Title of publication | Multiresponsive Luminescent Cationic Cyclometalated Gold(III) Amphiphiles and Their Supramolecular Assembly. |
Authors of publication | Leung, Ming-Yi; Leung, Sammual Yu-Lut; Yim, King-Chin; Chan, Alan Kwun-Wa; Ng, Maggie; Yam, Vivian Wing-Wah |
Journal of publication | Journal of the American Chemical Society |
Year of publication | 2019 |
Journal volume | 141 |
Journal issue | 49 |
Pages of publication | 19466 - 19478 |
a | 8.3336 ± 0.0004 Å |
b | 9.1601 ± 0.0004 Å |
c | 19.8551 ± 0.0009 Å |
α | 92.442 ± 0.001° |
β | 99.223 ± 0.001° |
γ | 98.617 ± 0.001° |
Cell volume | 1475.74 ± 0.12 Å3 |
Cell temperature | 100 K |
Ambient diffraction temperature | 100 K |
Number of distinct elements | 7 |
Space group number | 2 |
Hermann-Mauguin space group symbol | P -1 |
Hall space group symbol | -P 1 |
Residual factor for all reflections | 0.0161 |
Residual factor for significantly intense reflections | 0.0153 |
Weighted residual factors for significantly intense reflections | 0.0379 |
Weighted residual factors for all reflections included in the refinement | 0.0385 |
Goodness-of-fit parameter for all reflections included in the refinement | 1.047 |
Diffraction radiation probe | x-ray |
Diffraction radiation wavelength | 0.71073 Å |
Diffraction radiation type | MoKα |