Information card for entry 4133912
Formula | C14 H19 B O4 |
Calculated formula | C14 H19 B O4 |
SMILES | O(C(=O)c1cc(ccc1)B1OC(C(O1)(C)C)(C)C)C |
Title of publication | Visible Light-Induced Borylation of C-O, C-N, and C-X Bonds. |
Authors of publication | Jin, Shengfei; Dang, Hang T.; Haug, Graham C.; He, Ru; Nguyen, Viet D.; Nguyen, Vu T.; Arman, Hadi D.; Schanze, Kirk S.; Larionov, Oleg V. |
Journal of publication | Journal of the American Chemical Society |
Year of publication | 2020 |
Journal volume | 142 |
Journal issue | 3 |
Pages of publication | 1603 - 1613 |
a | 10.2772 ± 0.0004 Å |
b | 6.1873 ± 0.0002 Å |
c | 11.9566 ± 0.0005 Å |
α | 90° |
β | 113.206 ± 0.004° |
γ | 90° |
Cell volume | 698.79 ± 0.05 Å3 |
Cell temperature | 98 ± 2 K |
Ambient diffraction temperature | 98 ± 2 K |
Number of distinct elements | 4 |
Space group number | 4 |
Hermann-Mauguin space group symbol | P 1 21 1 |
Hall space group symbol | P 2yb |
Residual factor for all reflections | 0.0289 |
Residual factor for significantly intense reflections | 0.0286 |
Weighted residual factors for significantly intense reflections | 0.0663 |
Weighted residual factors for all reflections included in the refinement | 0.0664 |
Goodness-of-fit parameter for all reflections included in the refinement | 1.006 |
Diffraction radiation probe | x-ray |
Diffraction radiation wavelength | 0.71073 Å |
Diffraction radiation type | MoKα |