Information card for entry 4135189
Formula | C10 H10 N3 O3 Zn |
Calculated formula | C10 H10 N3 O3 Zn |
Title of publication | Amino Acid Residues Determine the Response of Flexible Metal-Organic Frameworks to Guests. |
Authors of publication | Yan, Yong; Carrington, Elliot J.; Pétuya, Rémi; Whitehead, George F. S.; Verma, Ajay; Hylton, Rebecca K.; Tang, Chiu C.; Berry, Neil G.; Darling, George R.; Dyer, Matthew S.; Antypov, Dmytro; Katsoulidis, Alexandros P.; Rosseinsky, Matthew J. |
Journal of publication | Journal of the American Chemical Society |
Year of publication | 2020 |
a | 26.583 ± 0.0012 Å |
b | 26.583 ± 0.0012 Å |
c | 10.1311 ± 0.0004 Å |
α | 90° |
β | 90° |
γ | 120° |
Cell volume | 6200.1 ± 0.5 Å3 |
Cell temperature | 100 K |
Ambient diffraction temperature | 100 K |
Number of distinct elements | 5 |
Space group number | 161 |
Hermann-Mauguin space group symbol | R 3 c :H |
Hall space group symbol | R 3 -2"c |
Residual factor for all reflections | 0.0931 |
Residual factor for significantly intense reflections | 0.0811 |
Weighted residual factors for significantly intense reflections | 0.2014 |
Weighted residual factors for all reflections included in the refinement | 0.2094 |
Goodness-of-fit parameter for all reflections included in the refinement | 1.115 |
Diffraction radiation probe | x-ray |
Diffraction radiation wavelength | 0.71073 Å |
Diffraction radiation type | MoKα |