Information card for entry 4135198
Formula | C7.51 H9.54 N3 O3.76 S0.76 Zn |
Calculated formula | C7.512 H9.536 N3 O3.756 S0.756 Zn |
Title of publication | Amino Acid Residues Determine the Response of Flexible Metal-Organic Frameworks to Guests. |
Authors of publication | Yan, Yong; Carrington, Elliot J.; Pétuya, Rémi; Whitehead, George F. S.; Verma, Ajay; Hylton, Rebecca K.; Tang, Chiu C.; Berry, Neil G.; Darling, George R.; Dyer, Matthew S.; Antypov, Dmytro; Katsoulidis, Alexandros P.; Rosseinsky, Matthew J. |
Journal of publication | Journal of the American Chemical Society |
Year of publication | 2020 |
a | 28.0952 ± 0.0014 Å |
b | 28.0952 ± 0.0014 Å |
c | 10.1517 ± 0.0005 Å |
α | 90° |
β | 90° |
γ | 120° |
Cell volume | 6939.6 ± 0.6 Å3 |
Cell temperature | 100 K |
Ambient diffraction temperature | 100 K |
Number of distinct elements | 6 |
Space group number | 161 |
Hermann-Mauguin space group symbol | R 3 c :H |
Hall space group symbol | R 3 -2"c |
Residual factor for all reflections | 0.0852 |
Residual factor for significantly intense reflections | 0.0752 |
Weighted residual factors for significantly intense reflections | 0.2169 |
Weighted residual factors for all reflections included in the refinement | 0.2268 |
Goodness-of-fit parameter for all reflections included in the refinement | 1.061 |
Diffraction radiation probe | x-ray |
Diffraction radiation wavelength | 0.71073 Å |
Diffraction radiation type | MoKα |