Information card for entry 4301655
Formula | C57 H70 Mn N |
Calculated formula | C57 H70 Mn N |
Title of publication | Spin-State Crossover with Structural Changes in a Cobalt(II) Organometallic Species: Low-Coordinate, First Row, Heteroleptic Amido Transition Metal Aryls. Synthesis and Characterization of Ar'MN(H)Ar# (M = Mn, Fe, Co) (Ar' = C6H3-2,6-(C6H3-2,6-iPr2)2, Ar#= C6H3-2,6-(C6H2-2,4,6-Me3)2) |
Authors of publication | Chengbao Ni; James C. Fettinger; Gary J. Long; Philip P. Power |
Journal of publication | Inorganic Chemistry |
Year of publication | 2009 |
Journal volume | 48 |
Pages of publication | 2443 - 2448 |
a | 10.6554 ± 0.0007 Å |
b | 12.521 ± 0.0008 Å |
c | 20.2032 ± 0.0013 Å |
α | 75.825 ± 0.001° |
β | 82.46 ± 0.001° |
γ | 68.015 ± 0.001° |
Cell volume | 2421 ± 0.3 Å3 |
Cell temperature | 90 ± 2 K |
Ambient diffraction temperature | 90 ± 2 K |
Number of distinct elements | 4 |
Space group number | 2 |
Hermann-Mauguin space group symbol | P -1 |
Hall space group symbol | -P 1 |
Residual factor for all reflections | 0.0469 |
Residual factor for significantly intense reflections | 0.0405 |
Weighted residual factors for significantly intense reflections | 0.1171 |
Weighted residual factors for all reflections included in the refinement | 0.1218 |
Goodness-of-fit parameter for all reflections included in the refinement | 1.074 |
Diffraction radiation wavelength | 0.71073 Å |
Diffraction radiation type | MoKα |