Information card for entry 4303403
Formula | C24 H39 Au F6 Mo2 O3 P4 |
Calculated formula | C24 H39 Au F6 Mo2 O3 P4 |
Title of publication | Reactions of the Unsaturated Complex [Mo2(η5-C5H5)2(μ-PEt2)2(CO)2] with [Au(PR3)]+ Cations: Kinetic Preference of the Mo-P Bonds as the Site of Attack of the Gold(I) Electrophile |
Authors of publication | M. Angeles Alvarez; M. Esther García; Daniel García-Vivó; M. Eugenia Martínez; Miguel A. Ruiz |
Journal of publication | Inorganic Chemistry |
Year of publication | 2009 |
Journal volume | 48 |
Pages of publication | 9767 - 9778 |
a | 11.842 ± 0.002 Å |
b | 10.29 ± 0.0018 Å |
c | 26.454 ± 0.005 Å |
α | 90° |
β | 98.835 ± 0.003° |
γ | 90° |
Cell volume | 3185.3 ± 1 Å3 |
Cell temperature | 120 ± 0.1 K |
Ambient diffraction temperature | 120 ± 2 K |
Number of distinct elements | 7 |
Space group number | 14 |
Hermann-Mauguin space group symbol | P 1 21/n 1 |
Hall space group symbol | -P 2yn |
Residual factor for all reflections | 0.037 |
Residual factor for significantly intense reflections | 0.029 |
Weighted residual factors for significantly intense reflections | 0.0647 |
Weighted residual factors for all reflections included in the refinement | 0.0676 |
Goodness-of-fit parameter for all reflections included in the refinement | 1.071 |
Diffraction radiation probe | x-ray |
Diffraction radiation wavelength | 0.71073 Å |
Diffraction radiation type | MoKα |