Information card for entry 4303684
Formula | C10 H15 Cl4 N5 O16 U |
Calculated formula | C10 H12 Cl4 N5 O16 U |
SMILES | C(#N)C.[U]([N]#CC)([N]#CC)([N]#CC)([N]#CC)(OCl(=O)(=O)=O)(OCl(=O)(=O)=O)(OCl(=O)(=O)=O)OCl(=O)(=O)=O |
Title of publication | Nitrate and Perchlorate Complexes of Uranium(IV) |
Authors of publication | Margaret-Jane Crawford; Arkady Ellern; Konstantin Karaghiosoff; Peter Mayer |
Journal of publication | Inorganic Chemistry |
Year of publication | 2009 |
Journal volume | 48 |
Pages of publication | 10877 - 10879 |
a | 10.655 ± 0.0001 Å |
b | 10.655 ± 0.0001 Å |
c | 11.1445 ± 0.0002 Å |
α | 90° |
β | 90° |
γ | 90° |
Cell volume | 1265.22 ± 0.03 Å3 |
Cell temperature | 200 K |
Ambient diffraction temperature | 200 ± 2 K |
Number of distinct elements | 6 |
Space group number | 104 |
Hermann-Mauguin space group symbol | P 4 n c |
Hall space group symbol | P 4 -2n |
Residual factor for all reflections | 0.0265 |
Residual factor for significantly intense reflections | 0.0156 |
Weighted residual factors for significantly intense reflections | 0.0356 |
Weighted residual factors for all reflections included in the refinement | 0.0429 |
Goodness-of-fit parameter for all reflections included in the refinement | 1.185 |
Diffraction radiation wavelength | 0.71073 Å |
Diffraction radiation type | MoKα |